Target
Peroxisome proliferator-activated receptor gamma
Ligand
BDBM50315659
Substrate
Meas. Tech.
ChEMBL_623965 (CHEMBL1116011)
EC50
7800±n/a nM
Citation
 Thieme, TMSteri, RProschak, EPaulke, ASchneider, GSchubert-Zsilavecz, M Rational design of a pirinixic acid derivative that acts as subtype-selective PPARgamma modulator. Bioorg Med Chem Lett 20:2469-73 (2010)  
Target
Name:
Peroxisome proliferator-activated receptor gamma
Synonyms:
NR1C3 PPAR-gamma PPARG_HUMAN Peroxisome proliferator-activated receptor gamma (PPAR gamma) Peroxisome proliferator-activated receptor gamma (PPARĪ³) peroxisome proliferator-activated receptor gamma isoform 2
Type:
Nuclear Receptor
Mol. Mass.:
57613.46
Organism:
Homo sapiens (Human)
Description:
P37231
Residue:
505
  
Inhibitor
Name:
BDBM50315659
Synonyms:
2-(4-chloro-6-(3,4-dimethylphenylamino)pyrimidin-2-ylthio)-2-(naphthalen-1-yl)acetic acid | CHEMBL1091866
Type:
Small organic molecule
Emp. Form.:
C24H20ClN3O2S
Mol. Mass.:
449.953
SMILES:
Cc1ccc(Nc2cc(Cl)nc(SC(C(O)=O)c3cccc4ccccc34)n2)cc1C
: