Target
Peroxisome proliferator-activated receptor gamma
Ligand
BDBM50315663
Substrate
Meas. Tech.
ChEMBL_623965 (CHEMBL1116011)
EC50
13000±n/a nM
Citation
 Thieme, TMSteri, RProschak, EPaulke, ASchneider, GSchubert-Zsilavecz, M Rational design of a pirinixic acid derivative that acts as subtype-selective PPARgamma modulator. Bioorg Med Chem Lett 20:2469-73 (2010)  
Target
Name:
Peroxisome proliferator-activated receptor gamma
Synonyms:
NR1C3 PPAR-gamma PPARG_HUMAN Peroxisome proliferator-activated receptor gamma (PPAR gamma) Peroxisome proliferator-activated receptor gamma (PPARĪ³) peroxisome proliferator-activated receptor gamma isoform 2
Type:
Nuclear Receptor
Mol. Mass.:
57613.46
Organism:
Homo sapiens (Human)
Description:
P37231
Residue:
505
  
Inhibitor
Name:
BDBM50315663
Synonyms:
2-(4-chloro-6-(4-fluorophenylamino)pyrimidin-2-ylthio)-2-(naphthalen-1-yl)acetic acid | CHEMBL1090814
Type:
Small organic molecule
Emp. Form.:
C22H15ClFN3O2S
Mol. Mass.:
439.89
SMILES:
OC(=O)C(Sc1nc(Cl)cc(Nc2ccc(F)cc2)n1)c1cccc2ccccc12
: