Target
Poly [ADP-ribose] polymerase 1
Ligand
BDBM50316246
Substrate
Meas. Tech.
ChEMBL_628377 (CHEMBL1115415)
IC50
55±n/a nM
Citation
 Jones, PAltamura, SBoueres, JFerrigno, FFonsi, MGiomini, CLamartina, SMonteagudo, EOntoria, JMOrsale, MVPalumbi, MCPesci, SRoscilli, GScarpelli, RSchultz-Fademrecht, CToniatti, CRowley, M Discovery of 2-{4-[(3S)-piperidin-3-yl]phenyl}-2H-indazole-7-carboxamide (MK-4827): a novel oral poly(ADP-ribose)polymerase (PARP) inhibitor efficacious in BRCA-1 and -2 mutant tumors. J Med Chem 52:7170-85 (2009)  
Target
Name:
Poly [ADP-ribose] polymerase 1
Synonyms:
(ARTD1 or PARP1) 2.4.2.30 ADPRT ARTD1 Human diphtheria toxin-like ADP-ribosyltransferase (ARTD1 or PARP1) NT-PARP-1 PARP1 PPOL Poly [ADP-ribose] polymerase 1 (PARP) Poly [ADP-ribose] polymerase 1 (PARP1) Poly [ADP-ribose] polymerase 1, 28-kDa form Poly [ADP-ribose] polymerase 1, processed C-terminus Poly [ADP-ribose] polymerase-1 Poly(ADP-ribose) polymerase-1 (ARTD1/PARP1) Protein poly-ADP-ribosyltransferase PARP1 | Synonyms=ADPRT
Type:
Mol. Mass.:
113114.22
Organism:
Homo sapiens (Human)
Description:
P09874
Residue:
1014
  
Inhibitor
Name:
BDBM50316246
Synonyms:
2-phenylpyrazolo-[1,5-a]pyridine-7-carboxamide | CHEMBL1169488
Type:
Small organic molecule
Emp. Form.:
C14H17N3O
Mol. Mass.:
243.3043
SMILES:
NC(=O)c1cccc2cc(nn12)C1CCCCC1
: