Target
P2Y purinoceptor 12
Ligand
BDBM50318031
Substrate
Meas. Tech.
ChEMBL_631130 (CHEMBL1107394)
IC50
0.7±n/a nM
Citation
 Calleri, ECeruti, SCristalli, GMartini, CTemporini, CParravicini, CVolpini, RDaniele, SCaccialanza, GLecca, DLambertucci, CTrincavelli, MLMarucci, GWainer, IWRanghino, GFantucci, PAbbracchio, MPMassolini, G Frontal affinity chromatography-mass spectrometry useful for characterization of new ligands for GPR17 receptor. J Med Chem 53:3489-501 (2010)  
Target
Name:
P2Y purinoceptor 12
Synonyms:
ADP-glucose receptor HORK3 P2T(AC) P2Y(AC) P2Y(cyc) P2Y12 platelet ADP receptor Purinergic receptor P2Y12 | SP1999
Type:
Enzyme
Mol. Mass.:
39458.48
Organism:
Homo sapiens (Human)
Description:
Q9H244
Residue:
342
  
Inhibitor
Name:
BDBM50318031
Synonyms:
CHEMBL1097279 | cangrelor
Type:
Small organic molecule
Emp. Form.:
C17H21Cl2F3N5O12P3S2
Mol. Mass.:
772.33
SMILES:
CSCCNc1nc(SCCC(F)(F)F)nc2n(cnc12)[C@@H]1O[C@H](COP([O-])(=O)OP([O-])(=O)C(Cl)(Cl)P([O-])([O-])=O)[C@@H](O)[C@H]1O
: