Target
Lysophosphatidylserine lipase ABHD12
Ligand
BDBM50323040
Substrate
Meas. Tech.
ChEMBL_643596 (CHEMBL1212460)
IC50
>10000±n/a nM
Citation
 Gattinoni, SSimone, CDDallavalle, SFezza, FNannei, RBattista, NMinetti, PQuattrociocchi, GCaprioli, ABorsini, FCabri, WPenco, SMerlini, LMaccarrone, M A new group of oxime carbamates as reversible inhibitors of fatty acid amide hydrolase. Bioorg Med Chem Lett 20:4406-11 (2010)  
Target
Name:
Lysophosphatidylserine lipase ABHD12
Synonyms:
ABD12_MOUSE Monoacylglycerol lipase ABHD12
Type:
PROTEIN
Mol. Mass.:
45284.87
Organism:
Mus musculus
Description:
ChEMBL_643596
Residue:
398
  
Inhibitor
Name:
BDBM50323040
Synonyms:
1-(3-Thiophen-2-yl-phenyl)-ethanone, O-(phenylaminocarbonyl)oxime | CHEMBL1210154
Type:
Small organic molecule
Emp. Form.:
C19H16N2O2S
Mol. Mass.:
336.408
SMILES:
CC(=NOC(=O)Nc1ccccc1)c1cccc(c1)-c1cccs1
: