Target
Melanocyte-stimulating hormone receptor
Ligand
BDBM50323149
Substrate
Meas. Tech.
ChEMBL_643825 (CHEMBL1212689)
IC50
1900±n/a nM
Citation
 Hong, QBakshi, RKDellureficio, JHe, SYe, ZDobbelaar, PHSebhat, IKGuo, LLiu, JJian, TTang, RKalyani, RNMacneil, TVongs, ARosenblum, CIWeinberg, DHPeng, QTamvakopoulos, CMiller, RRStearns, RACashen, DMartin, WJChen, ASMetzger, JMChen, HYStrack, AMFong, TMMaclntyre, EVan der Ploeg, LHWyvratt, MJNargund, RP Optimization of privileged structures for selective and potent melanocortin subtype-4 receptor ligands. Bioorg Med Chem Lett 20:4483-6 (2010)  
Target
Name:
Melanocyte-stimulating hormone receptor
Synonyms:
MC1-R MSH-R MSHR_HUMAN Melanocortin receptor (M1 and M4) Melanocortin receptor 1 (MC1-R) | Melanocortin receptor 1 (MC1R)
Type:
Enzyme
Mol. Mass.:
34717.23
Organism:
Homo sapiens (Human)
Description:
Q01726
Residue:
317
  
Inhibitor
Name:
BDBM50323149
Synonyms:
CHEMBL1209318 N-(2-(4-((3S,4R)-1-tert-butyl-4-(2,4-difluorophenyl)pyrrolidine-3-carbonyl)piperazin-1-yl)-2-cyclohexylethyl)-N-isopropylpyridazine-3-carboxamide
Type:
Small organic molecule
Emp. Form.:
C35H50F2N6O2
Mol. Mass.:
624.8073
SMILES:
CC(C)N(CC(C1CCCCC1)N1CCN(CC1)C(=O)[C@@H]1CN(C[C@H]1c1ccc(F)cc1F)C(C)(C)C)C(=O)c1cccnn1
: