Target
Melanocortin receptor 4
Ligand
BDBM50323153
Substrate
Meas. Tech.
ChEMBL_643823 (CHEMBL1212687)
EC50
710±n/a nM
Citation
 Hong, QBakshi, RKDellureficio, JHe, SYe, ZDobbelaar, PHSebhat, IKGuo, LLiu, JJian, TTang, RKalyani, RNMacneil, TVongs, ARosenblum, CIWeinberg, DHPeng, QTamvakopoulos, CMiller, RRStearns, RACashen, DMartin, WJChen, ASMetzger, JMChen, HYStrack, AMFong, TMMaclntyre, EVan der Ploeg, LHWyvratt, MJNargund, RP Optimization of privileged structures for selective and potent melanocortin subtype-4 receptor ligands. Bioorg Med Chem Lett 20:4483-6 (2010)  
Target
Name:
Melanocortin receptor 4
Synonyms:
MC4-R MC4R_HUMAN Melanocortin receptor 4 (MC-4) Melanocortin receptor 4 (MC4R)
Type:
Enzyme
Mol. Mass.:
36949.50
Organism:
Homo sapiens (Human)
Description:
P32245
Residue:
332
  
Inhibitor
Name:
BDBM50323153
Synonyms:
((3S,4R)-1-tert-butyl-4-(2,4-difluorophenyl)pyrrolidin-3-yl)(4-(1-cyclohexyl-2-(dipropylamino)ethyl)piperazin-1-yl)methanone | CHEMBL1209193
Type:
Small organic molecule
Emp. Form.:
C33H54F2N4O
Mol. Mass.:
560.8049
SMILES:
CCCN(CCC)CC(C1CCCCC1)N1CCN(CC1)C(=O)[C@@H]1CN(C[C@H]1c1ccc(F)cc1F)C(C)(C)C
: