Target
Metabotropic glutamate receptor 5
Ligand
BDBM50323377
Substrate
Meas. Tech.
ChEMBL_643984 (CHEMBL1211883)
Ki
14±n/a nM
Citation
 Galambos, JWágner, GNógrádi, KBielik, AMolnár, LBobok, AHorváth, AKiss, BKolok, SNagy, JKurkó, DBakk, MLVastag, MSághy, KGyertyán, IGál, KGreiner, ISzombathelyi, ZKeseru, GMDomány, G Carbamoyloximes as novel non-competitive mGlu5 receptor antagonists. Bioorg Med Chem Lett 20:4371-5 (2010)  
Target
Name:
Metabotropic glutamate receptor 5
Synonyms:
GRM5_RAT Grm5 Mglur5 metabotropic glutamate 5/1-C metabotropic glutamate 5a
Type:
Enzyme
Mol. Mass.:
131900.14
Organism:
Rattus norvegicus (Rat)
Description:
P31424
Residue:
1203
  
Inhibitor
Name:
BDBM50323377
Synonyms:
(3-chlorophenylamino)(1,2-dicyclohexyl-3-(5-thioxocyclohexa-1,3-dienyl)propylideneaminooxy)methanone | CHEMBL1209402
Type:
Small organic molecule
Emp. Form.:
C26H33ClN2O2S
Mol. Mass.:
473.07
SMILES:
Clc1cccc(NC(=O)O\N=C(\C(Cc2ccsc2)C2CCCCC2)C2CCCCC2)c1
: