Target
Metabotropic glutamate receptor 5
Ligand
BDBM50323368
Substrate
Meas. Tech.
ChEMBL_643984 (CHEMBL1211883)
Ki
78±n/a nM
Citation
 Galambos, JWágner, GNógrádi, KBielik, AMolnár, LBobok, AHorváth, AKiss, BKolok, SNagy, JKurkó, DBakk, MLVastag, MSághy, KGyertyán, IGál, KGreiner, ISzombathelyi, ZKeseru, GMDomány, G Carbamoyloximes as novel non-competitive mGlu5 receptor antagonists. Bioorg Med Chem Lett 20:4371-5 (2010)  
Target
Name:
Metabotropic glutamate receptor 5
Synonyms:
GRM5_RAT Grm5 Mglur5 metabotropic glutamate 5/1-C metabotropic glutamate 5a
Type:
Enzyme
Mol. Mass.:
131900.14
Organism:
Rattus norvegicus (Rat)
Description:
P31424
Residue:
1203
  
Inhibitor
Name:
BDBM50323368
Synonyms:
1,2-dicyclohexyl-3-(1H-imidazol-1-yl)propan-1-one O-3-(trifluoromethyl)phenylcarbamoyl oxime | CHEMBL1209153
Type:
Small organic molecule
Emp. Form.:
C26H33F3N4O2
Mol. Mass.:
490.561
SMILES:
FC(F)(F)c1cccc(NC(=O)O\N=C(\C(Cn2ccnc2)C2CCCCC2)C2CCCCC2)c1
: