Target
Metabotropic glutamate receptor 5
Ligand
BDBM50323382
Substrate
Meas. Tech.
ChEMBL_643984 (CHEMBL1211883)
Ki
104±n/a nM
Citation
 Galambos, JWágner, GNógrádi, KBielik, AMolnár, LBobok, AHorváth, AKiss, BKolok, SNagy, JKurkó, DBakk, MLVastag, MSághy, KGyertyán, IGál, KGreiner, ISzombathelyi, ZKeseru, GMDomány, G Carbamoyloximes as novel non-competitive mGlu5 receptor antagonists. Bioorg Med Chem Lett 20:4371-5 (2010)  
Target
Name:
Metabotropic glutamate receptor 5
Synonyms:
GRM5_RAT Grm5 Mglur5 metabotropic glutamate 5/1-C metabotropic glutamate 5a
Type:
Enzyme
Mol. Mass.:
131900.14
Organism:
Rattus norvegicus (Rat)
Description:
P31424
Residue:
1203
  
Inhibitor
Name:
BDBM50323382
Synonyms:
(E)-2-((1H-imidazol-1-yl)methyl)cyclohexanone O-phenylcarbamoyl oxime CHEMBL1209152
Type:
Small organic molecule
Emp. Form.:
C17H20N4O2
Mol. Mass.:
312.3663
SMILES:
O=C(Nc1ccccc1)O\N=C1/CCCCC1Cn1ccnc1
: