Target
Metabotropic glutamate receptor 5
Ligand
BDBM50323369
Substrate
Meas. Tech.
ChEMBL_643985 (CHEMBL1211884)
IC50
561±n/a nM
Citation
 Galambos, JWágner, GNógrádi, KBielik, AMolnár, LBobok, AHorváth, AKiss, BKolok, SNagy, JKurkó, DBakk, MLVastag, MSághy, KGyertyán, IGál, KGreiner, ISzombathelyi, ZKeseru, GMDomány, G Carbamoyloximes as novel non-competitive mGlu5 receptor antagonists. Bioorg Med Chem Lett 20:4371-5 (2010)  
Target
Name:
Metabotropic glutamate receptor 5
Synonyms:
GRM5_RAT Grm5 Mglur5 metabotropic glutamate 5/1-C metabotropic glutamate 5a
Type:
Enzyme
Mol. Mass.:
131900.14
Organism:
Rattus norvegicus (Rat)
Description:
P31424
Residue:
1203
  
Inhibitor
Name:
BDBM50323369
Synonyms:
3-((1,2-dicyclohexyl-3-(1H-imidazol-1-yl)propylideneaminooxy)carbonylamino)benzonitrile | CHEMBL1209154
Type:
Small organic molecule
Emp. Form.:
C26H33N5O2
Mol. Mass.:
447.5725
SMILES:
O=C(Nc1cccc(c1)C#N)O\N=C(\C(Cn1ccnc1)C1CCCCC1)C1CCCCC1
: