Target
Metabotropic glutamate receptor 5
Ligand
BDBM50323375
Substrate
Meas. Tech.
ChEMBL_643985 (CHEMBL1211884)
IC50
194±n/a nM
Citation
 Galambos, JWágner, GNógrádi, KBielik, AMolnár, LBobok, AHorváth, AKiss, BKolok, SNagy, JKurkó, DBakk, MLVastag, MSághy, KGyertyán, IGál, KGreiner, ISzombathelyi, ZKeseru, GMDomány, G Carbamoyloximes as novel non-competitive mGlu5 receptor antagonists. Bioorg Med Chem Lett 20:4371-5 (2010)  
Target
Name:
Metabotropic glutamate receptor 5
Synonyms:
GRM5_RAT Grm5 Mglur5 metabotropic glutamate 5/1-C metabotropic glutamate 5a
Type:
Enzyme
Mol. Mass.:
131900.14
Organism:
Rattus norvegicus (Rat)
Description:
P31424
Residue:
1203
  
Inhibitor
Name:
BDBM50323375
Synonyms:
CHEMBL1209400 | c1,2-dicyclohexyl-3-(1H-pyrrol-3-yl)propan-1-one O-3-chlorophenylcarbamoyl oxime
Type:
Small organic molecule
Emp. Form.:
C26H34ClN3O2
Mol. Mass.:
456.02
SMILES:
Clc1cccc(NC(=O)O\N=C(\C(Cc2cc[nH]c2)C2CCCCC2)C2CCCCC2)c1
: