Target
Metabotropic glutamate receptor 5
Ligand
BDBM50323380
Substrate
Meas. Tech.
ChEMBL_643985 (CHEMBL1211884)
IC50
48±n/a nM
Citation
 Galambos, JWágner, GNógrádi, KBielik, AMolnár, LBobok, AHorváth, AKiss, BKolok, SNagy, JKurkó, DBakk, MLVastag, MSághy, KGyertyán, IGál, KGreiner, ISzombathelyi, ZKeseru, GMDomány, G Carbamoyloximes as novel non-competitive mGlu5 receptor antagonists. Bioorg Med Chem Lett 20:4371-5 (2010)  
Target
Name:
Metabotropic glutamate receptor 5
Synonyms:
GRM5_RAT Grm5 Mglur5 metabotropic glutamate 5/1-C metabotropic glutamate 5a
Type:
Enzyme
Mol. Mass.:
131900.14
Organism:
Rattus norvegicus (Rat)
Description:
P31424
Residue:
1203
  
Inhibitor
Name:
BDBM50323380
Synonyms:
(1,2-dicyclohexyl-3-(6-thioxocyclohexa-1,3-dienyl)propylideneaminooxy)(m-tolylamino)methanone | CHEMBL1209478
Type:
Small organic molecule
Emp. Form.:
C27H36N2O2S
Mol. Mass.:
452.652
SMILES:
Cc1cccc(NC(=O)O\N=C(\C(Cc2cccs2)C2CCCCC2)C2CCCCC2)c1
: