Target
Bcl2-associated agonist of cell death
Ligand
BDBM50324474
Substrate
Meas. Tech.
ChEMBL_650244 (CHEMBL1219942)
IC50
1760±n/a nM
Citation
 Yan, FCao, XXJiang, HXZhao, XLWang, JYLin, YHLiu, QLZhang, CJiang, BGuo, F A novel water-soluble gossypol derivative increases chemotherapeutic sensitivity and promotes growth inhibition in colon cancer. J Med Chem 53:5502-10 (2010)  
Target
Name:
Bcl2-associated agonist of cell death
Synonyms:
BAD BBC6 Bcl-2-binding component 6 Bcl-XL/Bcl-2-associated death promoter Bcl2-L-8 | Bcl2-antagonist of cell death (BAD)
Type:
PROTEIN
Mol. Mass.:
18393.69
Organism:
Homo sapiens (Human)
Description:
ChEMBL_478760
Residue:
168
  
Inhibitor
Name:
BDBM50324474
Synonyms:
CHEMBL1215012 | sodium(2S,2'S,5R,5'R,6R,6'R)-6,6'-((1E,1'E)-(6,6',7,7'-tetrahydroxy-5,5'-diisopropyl-3,3'-dimethyl-1,1',4,4'-tetraoxo-1,1',4,4'-tetrahydro-2,2'-binaphthyl-8,8'-diyl)bis(methan-1-yl-1-ylidene)bis(azan-1-yl-1-ylidene))bis(3,3-dimethyl-7-oxo-4-thia-1-azabicyclo[3.2.0]heptane-2-carboxylate)
Type:
Small organic molecule
Emp. Form.:
C46H44N4O14S2
Mol. Mass.:
940.991
SMILES:
CC(C)=c1c(O)c(O)c(C=N[C@H]2[C@H]3SC(C)(C)[C@@H](N3C2=O)C([O-])=O)c2c(O)c(-c3c(O)c4c(C=N[C@H]5[C@H]6SC(C)(C)[C@@H](N6C5=O)C([O-])=O)c(O)c(O)c(=C(C)C)c4c(O)c3=C)c(=C)c(O)c12
: