Target
P-selectin glycoprotein ligand 1
Ligand
BDBM50201977
Substrate
Meas. Tech.
ChEMBL_649756 (CHEMBL1219454)
IC50
413000±n/a nM
Citation
 Huang, AMoretto, AJanz, KLowe, MBedard, PWTam, SDi, LClerin, VSushkova, NTchernychev, BTsao, DHKeith, JCShaw, GDSchaub, RGWang, QKaila, N Discovery of 2-[1-(4-chlorophenyl)cyclopropyl]-3-hydroxy-8-(trifluoromethyl)quinoline-4-carboxylic acid (PSI-421), a P-selectin inhibitor with improved pharmacokinetic properties and oral efficacy in models of vascular injury. J Med Chem 53:6003-17 (2010)  
Target
Name:
P-selectin glycoprotein ligand 1
Synonyms:
P-selectin glycoprotein ligand 1 SELPLG | SELPL_HUMAN
Type:
PROTEIN
Mol. Mass.:
43174.76
Organism:
Homo sapiens (Human)
Description:
ChEMBL_649756
Residue:
412
  
Inhibitor
Name:
BDBM50201977
Synonyms:
2-benzyl-3-hydroxy-7,8,9,10-tetrahydrobenzo[h]quinoline-4-carboxylic acid | CHEMBL384767
Type:
Small organic molecule
Emp. Form.:
C21H19NO3
Mol. Mass.:
333.3805
SMILES:
OC(=O)c1c(O)c(Cc2ccccc2)nc2c3CCCCc3ccc12
: