Target
P-selectin
Ligand
BDBM50324667
Substrate
Meas. Tech.
ChEMBL_649918 (CHEMBL1219616)
IC50
70000±n/a nM
Citation
 Huang, AMoretto, AJanz, KLowe, MBedard, PWTam, SDi, LClerin, VSushkova, NTchernychev, BTsao, DHKeith, JCShaw, GDSchaub, RGWang, QKaila, N Discovery of 2-[1-(4-chlorophenyl)cyclopropyl]-3-hydroxy-8-(trifluoromethyl)quinoline-4-carboxylic acid (PSI-421), a P-selectin inhibitor with improved pharmacokinetic properties and oral efficacy in models of vascular injury. J Med Chem 53:6003-17 (2010)  
Target
Name:
P-selectin
Synonyms:
GMRP LYAM3_HUMAN P-selectin/P-selectin glycoprotein ligand 1 | SELP
Type:
PROTEIN
Mol. Mass.:
90834.61
Organism:
Homo sapiens (Human)
Description:
ChEMBL_1438999
Residue:
830
  
Inhibitor
Name:
BDBM50324667
Synonyms:
1,6-bis[3-(3-carboxymethylphenyl)-4-(2-R-D-mannopyranosyloxy)phenyl]hexane TBC-1269
Type:
Small organic molecule
Emp. Form.:
C46H54O16
Mol. Mass.:
862.9114
SMILES:
OC[C@H]1O[C@H](Oc2ccc(CCCCCCc3ccc(O[C@H]4O[C@H](CO)[C@@H](O)[C@H](O)[C@@H]4O)c(c3)-c3cccc(CC(O)=O)c3)cc2-c2cccc(CC(O)=O)c2)[C@@H](O)[C@@H](O)[C@@H]1O
: