Target
Caspase-1
Ligand
BDBM50325239
Substrate
Meas. Tech.
ChEMBL_651931 (CHEMBL1227461)
Ki
7±n/a nM
Citation
 Galatsis, PCaprathe, BDowning, DGilmore, JHarter, WHays, SKostlan, CLinn, KLunney, EPara, KThomas, AWarmus, JAllen, HBrady, KTalanian, RWalker, N Inhibition of interleukin-1beta converting enzyme (ICE or caspase 1) by aspartyl acyloxyalkyl ketones and aspartyl amidooxyalkyl ketones. Bioorg Med Chem Lett 20:5089-94 (2010)  
Target
Name:
Caspase-1
Synonyms:
CASP1 Caspase ICE IL1BCE Interleukin-1 beta-converting enzyme
Type:
Enzyme
Mol. Mass.:
45154.13
Organism:
Homo sapiens (Human)
Description:
P29466
Residue:
404
  
Inhibitor
Name:
BDBM50325239
Synonyms:
CHEMBL1223112
Type:
Small organic molecule
Emp. Form.:
C32H44N4O11
Mol. Mass.:
660.712
SMILES:
COC(=O)C[C@H]1CCC[C@H]2CC(=O)N(OCC(=O)[C@H](CC(O)=O)NC(=O)[C@H](C)NC(=O)[C@@H](NC(=O)OCc3ccccc3)C(C)C)[C@@H]12
: