Target
Cytochrome P450 1A1
Ligand
BDBM50325671
Substrate
Meas. Tech.
ChEMBL_652514 (CHEMBL1225717)
IC50
10973±n/a nM
Citation
 Takemura, HItoh, TYamamoto, KSakakibara, HShimoi, K Selective inhibition of methoxyflavonoids on human CYP1B1 activity. Bioorg Med Chem 18:6310-5 (2010)  
Target
Name:
Cytochrome P450 1A1
Synonyms:
CP1A1_HUMAN CYPIA1 Cytochrome P450 1A1 P450 form 6 P450-P1
Type:
Protein
Mol. Mass.:
58177.23
Organism:
Homo sapiens (Human)
Description:
P04798
Residue:
512
  
Inhibitor
Name:
BDBM50325671
Synonyms:
(2S)-2-(3,4-DIHYDROXYPHENYL)-5,7-DIHYDROXY-2,3-DIHYDRO-4H-CHROMEN-4-ONE (S)-2-(3,4-dihydroxyphenyl)-5,7-dihydroxy-2,3-dihydrochromen-4-one 5,7,3',4'-tetrahydroxyflavanone CHEMBL8996 eriodicryol hsp90_170
Type:
Small organic molecule
Emp. Form.:
C15H12O6
Mol. Mass.:
288.2522
SMILES:
Oc1cc(O)c2C(=O)C[C@H](Oc2c1)c1ccc(O)c(O)c1
: