Target
Cytochrome P450 1B1
Ligand
BDBM26667
Substrate
Meas. Tech.
ChEMBL_652515 (CHEMBL1225718)
IC50
1679±n/a nM
Citation
 Takemura, HItoh, TYamamoto, KSakakibara, HShimoi, K Selective inhibition of methoxyflavonoids on human CYP1B1 activity. Bioorg Med Chem 18:6310-5 (2010)  
Target
Name:
Cytochrome P450 1B1
Synonyms:
CP1B1_HUMAN CYPIB1 | Cytochrome P450 1B1 (CYP1B1)
Type:
PROTEIN
Mol. Mass.:
60861.81
Organism:
Homo sapiens (Human)
Description:
ChEMBL_1474523
Residue:
543
  
Inhibitor
Name:
BDBM26667
Synonyms:
(2S)-5,7-dihydroxy-2-phenyl-3,4-dihydro-2H-1-benzopyran-4-one CHEMBL399910
Type:
Flavonoid
Emp. Form.:
C15H12O4
Mol. Mass.:
256.2534
SMILES:
Oc1cc(O)c2C(=O)C[C@H](Oc2c1)c1ccccc1
: