Target
Cytochrome P450 1B1
Ligand
BDBM50325673
Substrate
Meas. Tech.
ChEMBL_652515 (CHEMBL1225718)
IC50
1024±n/a nM
Citation
 Takemura, HItoh, TYamamoto, KSakakibara, HShimoi, K Selective inhibition of methoxyflavonoids on human CYP1B1 activity. Bioorg Med Chem 18:6310-5 (2010)  
Target
Name:
Cytochrome P450 1B1
Synonyms:
CP1B1_HUMAN CYPIB1 | Cytochrome P450 1B1 (CYP1B1)
Type:
PROTEIN
Mol. Mass.:
60861.81
Organism:
Homo sapiens (Human)
Description:
ChEMBL_1474523
Residue:
543
  
Inhibitor
Name:
BDBM50325673
Synonyms:
5,7-dihydroxy-4'-methoxyflavanone ISOSAKUTANETIN naringenin 4'-methyl ether
Type:
Small organic molecule
Emp. Form.:
C16H14O5
Mol. Mass.:
286.2794
SMILES:
COc1ccc(cc1)[C@@H]1CC(=O)c2c(O)cc(O)cc2O1
: