Target
Cytochrome P450 1A1
Ligand
BDBM50325674
Substrate
Meas. Tech.
ChEMBL_652514 (CHEMBL1225717)
IC50
120±n/a nM
Citation
 Takemura, HItoh, TYamamoto, KSakakibara, HShimoi, K Selective inhibition of methoxyflavonoids on human CYP1B1 activity. Bioorg Med Chem 18:6310-5 (2010)  
Target
Name:
Cytochrome P450 1A1
Synonyms:
CP1A1_HUMAN CYPIA1 Cytochrome P450 1A1 P450 form 6 P450-P1
Type:
Protein
Mol. Mass.:
58177.23
Organism:
Homo sapiens (Human)
Description:
P04798
Residue:
512
  
Inhibitor
Name:
BDBM50325674
Synonyms:
3,5,7-trihydroxy-2-(3-hydroxy-4-methoxyphenyl)-4H-chromen-4-one Tamarixetin (22) | tamarixetin
Type:
Small organic molecule
Emp. Form.:
C16H12O7
Mol. Mass.:
316.2623
SMILES:
COc1ccc(cc1O)-c1oc2cc(O)cc(O)c2c(=O)c1O
: