Target
Cytochrome P450 1A1
Ligand
BDBM23409
Substrate
Meas. Tech.
ChEMBL_652514 (CHEMBL1225717)
IC50
56±n/a nM
Citation
 Takemura, HItoh, TYamamoto, KSakakibara, HShimoi, K Selective inhibition of methoxyflavonoids on human CYP1B1 activity. Bioorg Med Chem 18:6310-5 (2010)  
Target
Name:
Cytochrome P450 1A1
Synonyms:
CP1A1_HUMAN CYPIA1 Cytochrome P450 1A1 P450 form 6 P450-P1
Type:
Protein
Mol. Mass.:
58177.23
Organism:
Homo sapiens (Human)
Description:
P04798
Residue:
512
  
Inhibitor
Name:
BDBM23409
Synonyms:
3,5,7-trihydroxy-2-(4-hydroxy-3-methoxyphenyl)-4H-chromen-4-one Isorhamnetin | Isorhamnetin (17)
Type:
flavonol
Emp. Form.:
C16H12O7
Mol. Mass.:
316.2623
SMILES:
COc1cc(ccc1O)-c1oc2cc(O)cc(O)c2c(=O)c1O
: