Target
Cytochrome P450 1B1
Ligand
BDBM50049391
Substrate
Meas. Tech.
ChEMBL_652515 (CHEMBL1225718)
IC50
25±n/a nM
Citation
 Takemura, HItoh, TYamamoto, KSakakibara, HShimoi, K Selective inhibition of methoxyflavonoids on human CYP1B1 activity. Bioorg Med Chem 18:6310-5 (2010)  
Target
Name:
Cytochrome P450 1B1
Synonyms:
CP1B1_HUMAN CYPIB1 | Cytochrome P450 1B1 (CYP1B1)
Type:
PROTEIN
Mol. Mass.:
60861.81
Organism:
Homo sapiens (Human)
Description:
ChEMBL_1474523
Residue:
543
  
Inhibitor
Name:
BDBM50049391
Synonyms:
3,5,7-Trihydroxyflavone 3,5,7-trihydroxy-2-phenyl-4H-benzopyran-4-one CHEMBL309490 Galangin (15) cid_5281616 | norizalpinin
Type:
Small organic molecule
Emp. Form.:
C15H10O5
Mol. Mass.:
270.2369
SMILES:
Oc1cc(O)c2c(c1)oc(-c1ccccc1)c(O)c2=O
: