Target
Cytochrome P450 1B1
Ligand
BDBM23409
Substrate
Meas. Tech.
ChEMBL_652515 (CHEMBL1225718)
IC50
17±n/a nM
Citation
 Takemura, HItoh, TYamamoto, KSakakibara, HShimoi, K Selective inhibition of methoxyflavonoids on human CYP1B1 activity. Bioorg Med Chem 18:6310-5 (2010)  
Target
Name:
Cytochrome P450 1B1
Synonyms:
CP1B1_HUMAN CYPIB1 | Cytochrome P450 1B1 (CYP1B1)
Type:
PROTEIN
Mol. Mass.:
60861.81
Organism:
Homo sapiens (Human)
Description:
ChEMBL_1474523
Residue:
543
  
Inhibitor
Name:
BDBM23409
Synonyms:
3,5,7-trihydroxy-2-(4-hydroxy-3-methoxyphenyl)-4H-chromen-4-one Isorhamnetin | Isorhamnetin (17)
Type:
flavonol
Emp. Form.:
C16H12O7
Mol. Mass.:
316.2623
SMILES:
COc1cc(ccc1O)-c1oc2cc(O)cc(O)c2c(=O)c1O
: