Target
Potassium/sodium hyperpolarization-activated cyclic nucleotide-gated channel 4
Ligand
BDBM50326992
Substrate
Meas. Tech.
ChEMBL_663439 (CHEMBL1250987)
EC50
4280±n/a nM
Citation
 Melchiorre, MDel Lungo, MGuandalini, LMartini, EDei, SManetti, DScapecchi, STeodori, ESartiani, LMugelli, ACerbai, ERomanelli, MN Design, synthesis, and preliminary biological evaluation of new isoform-selective f-current blockers. J Med Chem 53:6773-7 (2010)  
Target
Name:
Potassium/sodium hyperpolarization-activated cyclic nucleotide-gated channel 4
Synonyms:
HCN4 | HCN4_HUMAN
Type:
PROTEIN
Mol. Mass.:
129069.19
Organism:
Homo sapiens (Human)
Description:
ChEMBL_1454251
Residue:
1203
  
Inhibitor
Name:
BDBM50326992
Synonyms:
CHEMBL471737 | ivabradine
Type:
Small organic molecule
Emp. Form.:
C27H36N2O5
Mol. Mass.:
468.5851
SMILES:
COc1cc2C[C@H](CN(C)CCCN3CCc4cc(OC)c(OC)cc4CC3=O)c2cc1OC
: