Target
G-protein coupled bile acid receptor 1
Ligand
BDBM50327537
Substrate
Meas. Tech.
ChEMBL_664648 (CHEMBL1260362)
IC50
5500±n/a nM
Citation
 Herbert, MRSiegel, DLStaszewski, LCayanan, CBanerjee, UDhamija, SAnderson, JFan, AWang, LRix, PShiau, AKRao, TSNoble, SAHeyman, RABischoff, EGuha, MKabakibi, APinkerton, AB Synthesis and SAR of 2-aryl-3-aminomethylquinolines as agonists of the bile acid receptor TGR5. Bioorg Med Chem Lett 20:5718-21 (2010)  
Target
Name:
G-protein coupled bile acid receptor 1
Synonyms:
BG37 GPBAR_HUMAN TGR5 hGPCR19
Type:
G Protein-Coupled Receptor (GPCR)
Mol. Mass.:
35260.02
Organism:
Homo sapiens (Human)
Description:
CHO cells transiently transfected with hTGR5.
Residue:
330
  
Inhibitor
Name:
BDBM50327537
Synonyms:
2-(4-bromophenyl)-N-((2-(thiophen-3-yl)quinolin-3-yl)methyl)ethanamine | CHEMBL1257490
Type:
Small organic molecule
Emp. Form.:
C22H19BrN2S
Mol. Mass.:
423.369
SMILES:
Brc1ccc(CCNCc2cc3ccccc3nc2-c2ccsc2)cc1
: