Target
Integrin alpha-V/beta-3
Ligand
BDBM50327755
Substrate
Meas. Tech.
ChEMBL_664843 (CHEMBL1259567)
IC50
>10000±n/a nM
Citation
 Trabocchi, AMenchi, GCini, NBianchini, FRaspanti, SBottoncetti, APupi, ACalorini, LGuarna, A Click-chemistry-derived triazole ligands of arginine-glycine-aspartate (RGD) integrins with a broad capacity to inhibit adhesion of melanoma cells and both in vitro and in vivo angiogenesis. J Med Chem 53:7119-28 (2010)  
Target
Name:
Integrin alpha-V/beta-3
Synonyms:
ITGAV/ITGB3 | Integrin beta-3/Vitronectin receptor alpha
Type:
Enzyme
Mol. Mass.:
Description:
Components:
This complex has 2 components.
Component 1
Name:
Integrin alpha-V
Synonyms:
ITAV_HUMAN Integrin alpha-V/alpha-5 VNRA Vitronectin receptor | Vitronectin receptor subunit alpha
Type:
PROTEIN
Mol. Mass.:
116024.92
Organism:
Homo sapiens (Human)
Description:
ChEMBL_582336
Residue:
1048
  
Component 2
Name:
Integrin beta-3
Synonyms:
CD_antigen=CD61 GPIIIa ITGB3 Platelet membrane glycoprotein IIIa
Type:
Protein
Mol. Mass.:
87038.91
Organism:
Homo sapiens (Human)
Description:
P05106
Residue:
788
  
Inhibitor
Name:
BDBM50327755
Synonyms:
(S)-3-(2-{4-[2-(4-Carbamimidoylpiperazin-1-yl)ethyl][1,2,3]triazol-1-yl}acetylamino)-3-phenylpropionic Acid | CHEMBL1258214
Type:
Small organic molecule
Emp. Form.:
C19H26N8O3
Mol. Mass.:
414.4615
SMILES:
NC(=N)N1CCN(CCc2cn(CC(=O)N[C@@H](C(O)=O)c3ccccc3)nn2)CC1
: