Target
Integrin alpha-V/beta-5
Ligand
BDBM50327749
Substrate
Meas. Tech.
ChEMBL_664844 (CHEMBL1259568)
IC50
1780±n/a nM
Citation
 Trabocchi, AMenchi, GCini, NBianchini, FRaspanti, SBottoncetti, APupi, ACalorini, LGuarna, A Click-chemistry-derived triazole ligands of arginine-glycine-aspartate (RGD) integrins with a broad capacity to inhibit adhesion of melanoma cells and both in vitro and in vivo angiogenesis. J Med Chem 53:7119-28 (2010)  
Target
Name:
Integrin alpha-V/beta-5
Synonyms:
ITGAV/ITGB5 | Integrin beta-5/Vitronectin receptor alpha
Type:
Enzyme
Mol. Mass.:
Description:
Components:
This complex has 2 components.
Component 1
Name:
Integrin alpha-V
Synonyms:
ITAV_HUMAN Integrin alpha-V/alpha-5 VNRA Vitronectin receptor | Vitronectin receptor subunit alpha
Type:
PROTEIN
Mol. Mass.:
116024.92
Organism:
Homo sapiens (Human)
Description:
ChEMBL_582336
Residue:
1048
  
Component 2
Name:
Integrin beta-5
Synonyms:
ITB5_HUMAN | ITGB5
Type:
PROTEIN
Mol. Mass.:
88047.37
Organism:
Homo sapiens (Human)
Description:
EBI_10915
Residue:
799
  
Inhibitor
Name:
BDBM50327749
Synonyms:
(S)-3-[2-(4-Guanidinomethyl[1,2,3]triazol-1-yl)acetylamino]-3-phenylpropionic Acid | CHEMBL1257872
Type:
Small organic molecule
Emp. Form.:
C14H17N7O3
Mol. Mass.:
331.3299
SMILES:
[#7]\[#6](-[#7])=[#7]\[#6]-c1cn(-[#6]-[#6](=O)-[#7]-[#6@@H](-[#6](-[#8])=O)-c2ccccc2)nn1
: