Target
Integrin alpha-V/beta-5
Ligand
BDBM50327754
Substrate
Meas. Tech.
ChEMBL_664844 (CHEMBL1259568)
IC50
>10000±n/a nM
Citation
 Trabocchi, AMenchi, GCini, NBianchini, FRaspanti, SBottoncetti, APupi, ACalorini, LGuarna, A Click-chemistry-derived triazole ligands of arginine-glycine-aspartate (RGD) integrins with a broad capacity to inhibit adhesion of melanoma cells and both in vitro and in vivo angiogenesis. J Med Chem 53:7119-28 (2010)  
Target
Name:
Integrin alpha-V/beta-5
Synonyms:
ITGAV/ITGB5 | Integrin beta-5/Vitronectin receptor alpha
Type:
Enzyme
Mol. Mass.:
Description:
Components:
This complex has 2 components.
Component 1
Name:
Integrin alpha-V
Synonyms:
ITAV_HUMAN Integrin alpha-V/alpha-5 VNRA Vitronectin receptor | Vitronectin receptor subunit alpha
Type:
PROTEIN
Mol. Mass.:
116024.92
Organism:
Homo sapiens (Human)
Description:
ChEMBL_582336
Residue:
1048
  
Component 2
Name:
Integrin beta-5
Synonyms:
ITB5_HUMAN | ITGB5
Type:
PROTEIN
Mol. Mass.:
88047.37
Organism:
Homo sapiens (Human)
Description:
EBI_10915
Residue:
799
  
Inhibitor
Name:
BDBM50327754
Synonyms:
(S)-3-{2-[4-(4-Carbamimidoylpiperazin-1-ylmethyl)[1,2,3]triazol-1-yl]acetylamino}-3-phenylpropionic Acid | CHEMBL1258213
Type:
Small organic molecule
Emp. Form.:
C18H24N8O3
Mol. Mass.:
400.435
SMILES:
NC(=N)N1CCN(Cc2cn(CC(=O)N[C@@H](C(O)=O)c3ccccc3)nn2)CC1
: