Target
Alpha-1B adrenergic receptor
Ligand
BDBM50327861
Substrate
Meas. Tech.
ChEMBL_664937 (CHEMBL1259769)
Ki
4228±n/a nM
Citation
 Xu, RHong, JMorse, CLPike, VW Synthesis, structure-affinity relationships, and radiolabeling of selective high-affinity 5-HT4 receptor ligands as prospective imaging probes for positron emission tomography. J Med Chem 53:7035-47 (2010)  
Target
Name:
Alpha-1B adrenergic receptor
Synonyms:
ADA1B_HUMAN Adrenergic alpha1B Adrenergic receptor alpha Alpha 1B-adrenoreceptor | Alpha-1B adrenergic receptor
Type:
Enzyme
Mol. Mass.:
56862.13
Organism:
Homo sapiens (Human)
Description:
P35368
Residue:
520
  
Inhibitor
Name:
BDBM50327861
Synonyms:
(1-Butylpiperidin-4-yl)methyl 4-Amino-3-methoxybenzoate | CHEMBL1258452
Type:
Small organic molecule
Emp. Form.:
C18H28N2O3
Mol. Mass.:
320.4265
SMILES:
CCCCN1CCC(COC(=O)c2ccc(N)c(OC)c2)CC1
: