Target
Excitatory amino acid transporter 2
Ligand
BDBM50327882
Substrate
Meas. Tech.
ChEMBL_664973 (CHEMBL1259930)
IC50
17000±n/a nM
Citation
 Luethi, ENguyen, KTBürzle, MBlum, LCSuzuki, YHediger, MReymond, JL Identification of selective norbornane-type aspartate analogue inhibitors of the glutamate transporter 1 (GLT-1) from the chemical universe generated database (GDB). J Med Chem 53:7236-50 (2010)  
Target
Name:
Excitatory amino acid transporter 2
Synonyms:
EAA2_HUMAN GLT1 SLC1A2 Solute carrier family 1 member 2
Type:
Enzyme Catalytic Domain
Mol. Mass.:
62103.57
Organism:
Homo sapiens (Human)
Description:
Excitatory Amino Acid EAAT2 0 0::P43004
Residue:
574
  
Inhibitor
Name:
BDBM50327882
Synonyms:
(1R*,2R*,3S*,4R*,6R*)-2-Amino-6-[2-(4-chloro-phenyl)-ethyl]-bicyclo[2.2.1]heptane-2,3-dicarboxylic Acid Trifluoroacetate | CHEMBL1257407
Type:
Small organic molecule
Emp. Form.:
C17H20ClNO4
Mol. Mass.:
337.798
SMILES:
N[C@@]1(C2C[C@H](C[C@H]2CCc2ccc(Cl)cc2)[C@@H]1C(O)=O)C(O)=O
: