Target
Fatty acid synthase
Ligand
BDBM50241453
Substrate
Meas. Tech.
ChEMBL_665032 (CHEMBL1260142)
IC50
1240±n/a nM
Citation
 Jiang, HZQuan, XFTian, WXHu, JMWang, PCHuang, SZCheng, ZQLiang, WJZhou, JMa, XFZhao, YX Fatty acid synthase inhibitors of phenolic constituents isolated from Garcinia mangostana. Bioorg Med Chem Lett 20:6045-7 (2010)  
Target
Name:
Fatty acid synthase
Synonyms:
FAS FAS_HUMAN HU FASN
Type:
Enzyme
Mol. Mass.:
273419.37
Organism:
Homo sapiens (Human)
Description:
P49327
Residue:
2511
  
Inhibitor
Name:
BDBM50241453
Synonyms:
1,3,6,7-tetrahydroxy-2,8-bis(3-methylbut-2-enyl)-9H-xanthen-9-one gamma-mangostin
Type:
Small organic molecule
Emp. Form.:
C23H24O6
Mol. Mass.:
396.4331
SMILES:
[#6]\[#6](-[#6])=[#6]\[#6]-c1c(-[#8])cc2oc3cc(-[#8])c(-[#8])c(-[#6]\[#6]=[#6](\[#6])-[#6])c3c(=O)c2c1-[#8]
: