Target
Lysosomal Pro-X carboxypeptidase
Ligand
BDBM50328550
Substrate
Meas. Tech.
ChEMBL_665678 (CHEMBL1261609)
IC50
68±n/a nM
Citation
 Zhou, CGarcia-Calvo, MPinto, SLombardo, MFeng, ZBender, KPryor, KDBhatt, URChabin, RMGeissler, WMShen, ZTong, XZhang, ZWong, KKRoy, RSChapman, KTYang, LXiong, Y Design and synthesis of prolylcarboxypeptidase (PrCP) inhibitors to validate PrCP as a potential target for obesity. J Med Chem 53:7251-63 (2010)  
Target
Name:
Lysosomal Pro-X carboxypeptidase
Synonyms:
Angiotensinase C PCP PRCP Prolylcarboxypeptidase | Prolylcarboxypeptidase (PRCP)
Type:
Enzyme
Mol. Mass.:
55805.19
Organism:
Homo sapiens (Human)
Description:
P42785
Residue:
496
  
Inhibitor
Name:
BDBM50328550
Synonyms:
CHEMBL1259218 | tert-Butyl{(2S)-3-(Biphenyl-4-yl)-1-oxo-1-[(2S)-2-(4-phenyl-1H-imidazol-2-yl)pyrrolidin-1-yl]propan-2-yl}carbamate
Type:
Small organic molecule
Emp. Form.:
C32H34N4O4
Mol. Mass.:
538.6368
SMILES:
CC(C)(C)OC(=O)N[C@@H](Cc1ccc(cc1)-c1ccccc1)C(=O)N1CCC[C@H]1C(=O)c1nc2ccccc2[nH]1
: