Target
PH domain leucine-rich repeat-containing protein phosphatase 2
Ligand
BDBM50328837
Substrate
Meas. Tech.
ChEMBL_673824 (CHEMBL1275001)
IC50
49000±n/a nM
Citation
 Sierecki, ESinko, WMcCammon, JANewton, AC Discovery of small molecule inhibitors of the PH domain leucine-rich repeat protein phosphatase (PHLPP) by chemical and virtual screening. J Med Chem 53:6899-911 (2010)  
Target
Name:
PH domain leucine-rich repeat-containing protein phosphatase 2
Synonyms:
KIAA0931 PHLP2_HUMAN PHLPP2 | PHLPPL
Type:
PROTEIN
Mol. Mass.:
146727.83
Organism:
Homo sapiens (Human)
Description:
ChEMBL_673824
Residue:
1323
  
Inhibitor
Name:
BDBM50328837
Synonyms:
2-hydroxy-5-((4'-((1-hydroxy-3-(methylsulfonyl)-7-(phenylamino)naphthalen-2-yl)diazenyl)biphenyl-4-yl)diazenyl)benzoic acid NSC-47760
Type:
Small organic molecule
Emp. Form.:
C36H27N5O6S
Mol. Mass.:
657.694
SMILES:
CS(=O)(=O)c1cc2ccc(Nc3ccccc3)cc2c(O)c1N=Nc1ccc(cc1)-c1ccc(cc1)N=Nc1ccc(O)c(c1)C(O)=O
: