Target
Adenosine receptor A2a
Ligand
BDBM50329364
Substrate
Meas. Tech.
ChEMBL_675428 (CHEMBL1273565)
Ki
3.1±n/a nM
Citation
 McGuinness, BFCole, AGDong, GBrescia, MRShao, YHenderson, IRokosz, LLStauffer, TMMannava, NKimble, EFHicks, CWhite, NWines, PGQuadros, E Discovery of 2-aminoimidazopyridine adenosine A(2A) receptor antagonists. Bioorg Med Chem Lett 20:6845-9 (2010)  
Target
Name:
Adenosine receptor A2a
Synonyms:
A2A adenosine receptor (hA2A) ADENOSINE A2 ADORA2 Adenosine A2A receptor (A2AAR)
Type:
G Protein-Coupled Receptor (GPCR)
Mol. Mass.:
44716.46
Organism:
Homo sapiens (Human)
Description:
P29274
Residue:
412
  
Inhibitor
Name:
BDBM50329364
Synonyms:
2-(3-cyanobenzamido)-N,N-diethyl-1-(3-methoxypropyl)-1H-benzo[d]imidazole-6-carboxamide | CHEMBL1269901
Type:
Small organic molecule
Emp. Form.:
C24H27N5O3
Mol. Mass.:
433.5029
SMILES:
CCN(CC)C(=O)c1ccc2nc(NC(=O)c3cccc(c3)C#N)n(CCCOC)c2c1
: