Target
Beta-secretase 1
Ligand
BDBM50329572
Substrate
Meas. Tech.
ChEMBL_674717 (CHEMBL1273970)
IC50
70±n/a nM
Citation
 Malamas, MSRobichaud, AErdei, JQuagliato, DSolvibile, WZhou, PMorris, KTurner, JWagner, EFan, KOlland, AJacobsen, SReinhart, PRiddell, DPangalos, M Design and synthesis of aminohydantoins as potent and selective humanß-secretase (BACE1) inhibitors with enhanced brain permeability. Bioorg Med Chem Lett 20:6597-605 (2010)  
Target
Name:
Beta-secretase 1
Synonyms:
ASP2 Aspartyl protease 2 BACE1 Beta-secretase (BACE) Beta-secretase 1 (BACE 1) Beta-secretase 1 (BACE1) Beta-site amyloid precursor protein cleaving enzyme 1 Memapsin-2 beta-Secretase (BACE-1) | beta-Secretase (BACE1)
Type:
Protein
Mol. Mass.:
55755.10
Organism:
Homo sapiens (Human)
Description:
P56817
Residue:
501
  
Inhibitor
Name:
BDBM50329572
Synonyms:
(R)-2-amino-4-(3-(2,2-difluoroethoxy)-4-fluorophenyl)-4-(4-(difluoromethoxy)-3-methylphenyl)-1-methyl-1H-imidazol-5(4H)-one | CHEMBL1270530
Type:
Small organic molecule
Emp. Form.:
C20H18F5N3O3
Mol. Mass.:
443.3672
SMILES:
CN1C(N)=N[C@](C1=O)(c1ccc(OC(F)F)c(C)c1)c1ccc(F)c(OCC(F)F)c1
: