Target
5-hydroxytryptamine receptor 3A
Ligand
BDBM93624
Substrate
Meas. Tech.
ChEMBL_674333 (CHEMBL1274533)
Ki
0.5±n/a nM
Citation
 Yang, ZFairfax, DJMaeng, JHMasih, LUsyatinsky, AHassler, CIsaacson, SFitzpatrick, KDeOrazio, RJChen, JHarding, JPIsherwood, MDobritsa, SChristensen, KLWierschke, JDBliss, BIPeterson, LHBeer, CMCioffi, CLynch, MRennells, WMRichards, JJRust, TKhmelnitsky, YLCohen, MLManning, DD Discovery of 2-substituted benzoxazole carboxamides as 5-HT3 receptor antagonists. Bioorg Med Chem Lett 20:6538-41 (2010)  
Target
Name:
5-hydroxytryptamine receptor 3A
Synonyms:
5-HT-3 5-HT3A 5-hydroxytryptamine receptor 3 (5-HT3) 5-hydroxytryptamine receptor 3A (5HT3A) 5HT3R HTR3A Serotonin 3 receptor (5HT3) Serotonin-gated ion channel receptor | Serotonin-gated ion channel receptor 3
Type:
Protein
Mol. Mass.:
55283.27
Organism:
Homo sapiens (Human)
Description:
P46098
Residue:
478
  
Inhibitor
Name:
BDBM93624
Synonyms:
5-methyl-2-[(5-methyl-1H-imidazol-4-yl)methyl]-3,4-dihydropyrid[4,3-b]indol-1-one;hydrochloride ALOSETRON MLS001401464 cid_60758
Type:
Small organic molecule
Emp. Form.:
C17H18N4O
Mol. Mass.:
294.351
SMILES:
Cc1nc[nH]c1CN1CCc2c(C1=O)c1ccccc1n2C
: