Target
Vesicular acetylcholine transporter
Ligand
BDBM50329774
Substrate
Meas. Tech.
ChEMBL_674755 (CHEMBL1274063)
Ki
56.9±n/a nM
Citation
 Kovac, MMavel, SDeuther-Conrad, WMéheux, NGlöckner, JWenzel, BAnderluh, MBrust, PGuilloteau, DEmond, P 3D QSAR study, synthesis, and in vitro evaluation of (+)-5-FBVM as potential PET radioligand for the vesicular acetylcholine transporter (VAChT). Bioorg Med Chem 18:7659-67 (2010)  
Target
Name:
Vesicular acetylcholine transporter
Synonyms:
Slc18a3 VACHT_RAT Vat | rVAT
Type:
PROTEIN
Mol. Mass.:
56533.41
Organism:
Rattus norvegicus
Description:
ChEMBL_1503353
Residue:
530
  
Inhibitor
Name:
BDBM50329774
Synonyms:
(+)-(2S,3S)-5-(2-fluoroethoxy)-3-(4-phenylpiperidin-1-yl)-1,2,3,4-tetrahydronaphthalen-2-ol | CHEMBL1271850
Type:
Small organic molecule
Emp. Form.:
C23H28FNO2
Mol. Mass.:
369.4723
SMILES:
O[C@H]1Cc2cccc(OCCF)c2C[C@@H]1N1CCC(CC1)c1ccccc1
: