Target
Vesicular acetylcholine transporter
Ligand
BDBM50329775
Substrate
Meas. Tech.
ChEMBL_674755 (CHEMBL1274063)
Ki
15.8±n/a nM
Citation
 Kovac, MMavel, SDeuther-Conrad, WMéheux, NGlöckner, JWenzel, BAnderluh, MBrust, PGuilloteau, DEmond, P 3D QSAR study, synthesis, and in vitro evaluation of (+)-5-FBVM as potential PET radioligand for the vesicular acetylcholine transporter (VAChT). Bioorg Med Chem 18:7659-67 (2010)  
Target
Name:
Vesicular acetylcholine transporter
Synonyms:
Slc18a3 VACHT_RAT Vat | rVAT
Type:
PROTEIN
Mol. Mass.:
56533.41
Organism:
Rattus norvegicus
Description:
ChEMBL_1503353
Residue:
530
  
Inhibitor
Name:
BDBM50329775
Synonyms:
(2R,3R)-5-Iodo-3-(4-phenyl-piperidin-1-yl)-1,2,3,4-tetrahydro-naphthalen-2-ol 5-Iodo-3-(4-phenyl-piperidin-1-yl)-1,2,3,4-tetrahydro-naphthalen-2-ol([I125]-(-)IBVM) | CHEMBL65239
Type:
Small organic molecule
Emp. Form.:
C21H24INO
Mol. Mass.:
433.3258
SMILES:
O[C@@H]1Cc2cccc(I)c2C[C@H]1N1CCC(CC1)c1ccccc1
: