Target
Peptidyl-prolyl cis-trans isomerase NIMA-interacting 1
Ligand
BDBM50329854
Substrate
Meas. Tech.
ChEMBL_675743 (CHEMBL1272377)
EC50
30000±n/a nM
Citation
 Potter, AOldfield, VNunns, CFromont, CRay, SNorthfield, CJBryant, CJScrace, SFRobinson, DMatossova, NBaker, LDokurno, PSurgenor, AEDavis, BRichardson, CMMurray, JBMoore, JD Discovery of cell-active phenyl-imidazole Pin1 inhibitors by structure-guided fragment evolution. Bioorg Med Chem Lett 20:6483-8 (2010)  
Target
Name:
Peptidyl-prolyl cis-trans isomerase NIMA-interacting 1
Synonyms:
PIN1 PPIase Pin1 | Peptidyl-prolyl cis-trans isomerase NIMA-interacting 1
Type:
PROTEIN
Mol. Mass.:
18248.11
Organism:
Homo sapiens (Human)
Description:
ChEMBL_1502595
Residue:
163
  
Inhibitor
Name:
BDBM50329854
Synonyms:
4-(benzyl(phenethyl)carbamoyl)-2-phenyl-1H-imidazole-5-carboxylic acid | CHEMBL1272245
Type:
Small organic molecule
Emp. Form.:
C26H23N3O3
Mol. Mass.:
425.4791
SMILES:
OC(=O)c1nc([nH]c1C(=O)N(CCc1ccccc1)Cc1ccccc1)-c1ccccc1
: