Target
Melanocortin receptor 4
Ligand
BDBM50329955
Substrate
Meas. Tech.
ChEMBL_675992 (CHEMBL1272930)
IC50
16±n/a nM
Citation
 He, SYe, ZDobbelaar, PHBakshi, RKHong, QDellureficio, JPSebhat, IKGuo, LLiu, JJian, TLai, YFranklin, CLReibarkh, MHolmes, MAWeinberg, DHMacNeil, TTang, RTamvakopoulos, CPeng, QMiller, RRStearns, RAChen, HYChen, ASStrack, AMFong, TMWyvratt, MJNargund, RP Discovery of highly potent and efficacious MC4R agonists with spiroindane N-Me-1,2,4-triazole privileged structures for the treatment of obesity. Bioorg Med Chem Lett 20:6524-32 (2010)  
Target
Name:
Melanocortin receptor 4
Synonyms:
MC4-R MC4R_HUMAN Melanocortin receptor 4 (MC-4) Melanocortin receptor 4 (MC4R)
Type:
Enzyme
Mol. Mass.:
36949.50
Organism:
Homo sapiens (Human)
Description:
P32245
Residue:
332
  
Inhibitor
Name:
BDBM50329955
Synonyms:
(3-(2-(1H-1,2,3-triazol-5-yl)propan-2-yl)-6-chloro-5-methyl-2,3-dihydrospiro[indene-1,4'-piperidine]-1'-yl)(1-tert-butyl-4-(2,4-difluorophenyl)pyrrolidin-3-yl)methanone | CHEMBL1269572
Type:
Small organic molecule
Emp. Form.:
C34H42ClF2N5O
Mol. Mass.:
610.18
SMILES:
Cc1cc2C(CC3(CCN(CC3)C(=O)[C@@H]3CN(C[C@H]3c3ccc(F)cc3F)C(C)(C)C)c2cc1Cl)C(C)(C)c1cnn[nH]1
: