Target
Melanocortin receptor 4
Ligand
BDBM50329953
Substrate
Meas. Tech.
ChEMBL_675993 (CHEMBL1272931)
EC50
14±n/a nM
Citation
 He, SYe, ZDobbelaar, PHBakshi, RKHong, QDellureficio, JPSebhat, IKGuo, LLiu, JJian, TLai, YFranklin, CLReibarkh, MHolmes, MAWeinberg, DHMacNeil, TTang, RTamvakopoulos, CPeng, QMiller, RRStearns, RAChen, HYChen, ASStrack, AMFong, TMWyvratt, MJNargund, RP Discovery of highly potent and efficacious MC4R agonists with spiroindane N-Me-1,2,4-triazole privileged structures for the treatment of obesity. Bioorg Med Chem Lett 20:6524-32 (2010)  
Target
Name:
Melanocortin receptor 4
Synonyms:
MC4-R MC4R_HUMAN Melanocortin receptor 4 (MC-4) Melanocortin receptor 4 (MC4R)
Type:
Enzyme
Mol. Mass.:
36949.50
Organism:
Homo sapiens (Human)
Description:
P32245
Residue:
332
  
Inhibitor
Name:
BDBM50329953
Synonyms:
1-tert-butyl-4-(2,4-difluorophenyl)pyrrolidin-3-yl)(6-chloro-5-methyl-3-(2-(5-methyl-1,2,4-oxadiazol-3-yl)propan-2-yl)-2,3-dihydrospiro[indene-1,4'-piperidine]-1'-yl)methanone | CHEMBL1269570
Type:
Small organic molecule
Emp. Form.:
C35H43ClF2N4O2
Mol. Mass.:
625.191
SMILES:
Cc1nc(no1)C(C)(C)C1CC2(CCN(CC2)C(=O)[C@@H]2CN(C[C@H]2c2ccc(F)cc2F)C(C)(C)C)c2cc(Cl)c(C)cc12
: