Target
Melanocortin receptor 4
Ligand
BDBM50329961
Substrate
Meas. Tech.
ChEMBL_675992 (CHEMBL1272930)
IC50
1.9±n/a nM
Citation
 He, SYe, ZDobbelaar, PHBakshi, RKHong, QDellureficio, JPSebhat, IKGuo, LLiu, JJian, TLai, YFranklin, CLReibarkh, MHolmes, MAWeinberg, DHMacNeil, TTang, RTamvakopoulos, CPeng, QMiller, RRStearns, RAChen, HYChen, ASStrack, AMFong, TMWyvratt, MJNargund, RP Discovery of highly potent and efficacious MC4R agonists with spiroindane N-Me-1,2,4-triazole privileged structures for the treatment of obesity. Bioorg Med Chem Lett 20:6524-32 (2010)  
Target
Name:
Melanocortin receptor 4
Synonyms:
MC4-R MC4R_HUMAN Melanocortin receptor 4 (MC-4) Melanocortin receptor 4 (MC4R)
Type:
Enzyme
Mol. Mass.:
36949.50
Organism:
Homo sapiens (Human)
Description:
P32245
Residue:
332
  
Inhibitor
Name:
BDBM50329961
Synonyms:
((3S,4R)-1-tert-butyl-4-(2,4-difluorophenyl)pyrrolidin-3-yl)(6-chloro-5-methyl-3-(2-(5-methyl-1,3,4-oxadiazol-2-yl)propan-2-yl)-2,3-dihydrospiro[indene-1,4'-piperidine]-1'-yl)methanone | CHEMBL1269569
Type:
Small organic molecule
Emp. Form.:
C35H43ClF2N4O2
Mol. Mass.:
625.191
SMILES:
Cc1nnc(o1)C(C)(C)[C@H]1CC2(CCN(CC2)C(=O)[C@@H]2CN(C[C@H]2c2ccc(F)cc2F)C(C)(C)C)c2cc(Cl)c(C)cc12
: