Target
Neuronal acetylcholine receptor subunit alpha-3/beta-4
Ligand
BDBM50147744
Substrate
Meas. Tech.
ChEMBL_684743 (CHEMBL1285770)
Ki
10000±n/a nM
Citation
 Zaveri, NJiang, FOlsen, CPolgar, WToll, L Novela3ß4 nicotinic acetylcholine receptor-selective ligands. Discovery, structure-activity studies, and pharmacological evaluation. J Med Chem 53:8187-91 (2010)  
Target
Name:
Neuronal acetylcholine receptor subunit alpha-3/beta-4
Synonyms:
Neuronal acetylcholine receptor Alpha-3/Beta-4 Neuronal acetylcholine receptor; alpha3/beta4 | nAChR subtypes alpha3 beta4
Type:
Protein
Mol. Mass.:
Description:
Components:
This complex has 2 components.
Component 1
Name:
Neuronal acetylcholine receptor subunit alpha-3
Synonyms:
ACHA3_RAT Chrna3
Type:
Enzyme
Mol. Mass.:
56995.52
Organism:
Rattus norvegicus (Rat)
Description:
P04757
Residue:
499
  
Component 2
Name:
Neuronal acetylcholine receptor subunit beta-4
Synonyms:
ACHB4_RAT Chrnb4 Neuronal acetylcholine receptor non-alpha-2 chain | Neuronal acetylcholine receptor protein beta-4 subunit
Type:
Enzyme
Mol. Mass.:
55863.89
Organism:
Rattus norvegicus (Rat)
Description:
P12392
Residue:
495
  
Inhibitor
Name:
BDBM50147744
Synonyms:
1-{1-[1-(4-Cyclohexyl-phenyl)-ethyl]-piperidin-4-yl}-1,3-dihydro-indol-2-one | CHEMBL97979
Type:
Small organic molecule
Emp. Form.:
C27H34N2O
Mol. Mass.:
402.5717
SMILES:
CC(N1CCC(CC1)N1C(=O)Cc2ccccc12)c1ccc(cc1)C1CCCCC1
: