Target
Neuronal acetylcholine receptor subunit alpha-3/beta-4
Ligand
BDBM50331013
Substrate
Meas. Tech.
ChEMBL_684743 (CHEMBL1285770)
Ki
10000±n/a nM
Citation
 Zaveri, NJiang, FOlsen, CPolgar, WToll, L Novela3ß4 nicotinic acetylcholine receptor-selective ligands. Discovery, structure-activity studies, and pharmacological evaluation. J Med Chem 53:8187-91 (2010)  
Target
Name:
Neuronal acetylcholine receptor subunit alpha-3/beta-4
Synonyms:
Neuronal acetylcholine receptor Alpha-3/Beta-4 Neuronal acetylcholine receptor; alpha3/beta4 | nAChR subtypes alpha3 beta4
Type:
Protein
Mol. Mass.:
Description:
Components:
This complex has 2 components.
Component 1
Name:
Neuronal acetylcholine receptor subunit alpha-3
Synonyms:
ACHA3_RAT Chrna3
Type:
Enzyme
Mol. Mass.:
56995.52
Organism:
Rattus norvegicus (Rat)
Description:
P04757
Residue:
499
  
Component 2
Name:
Neuronal acetylcholine receptor subunit beta-4
Synonyms:
ACHB4_RAT Chrnb4 Neuronal acetylcholine receptor non-alpha-2 chain | Neuronal acetylcholine receptor protein beta-4 subunit
Type:
Enzyme
Mol. Mass.:
55863.89
Organism:
Rattus norvegicus (Rat)
Description:
P12392
Residue:
495
  
Inhibitor
Name:
BDBM50331013
Synonyms:
CHEMBL1276233 | ethyl 3-(pyridin-3-yl)-9-azabicyclo[3.3.1]non-2-ene-9-carboxylate
Type:
Small organic molecule
Emp. Form.:
C16H20N2O2
Mol. Mass.:
272.3422
SMILES:
CCOC(=O)N1C2CCCC1C=C(C2)c1cccnc1
: