Target
Neuronal acetylcholine receptor subunit alpha-4/beta-2
Ligand
BDBM50147744
Substrate
Meas. Tech.
ChEMBL_684744 (CHEMBL1285771)
Ki
10000±n/a nM
Citation
 Zaveri, NJiang, FOlsen, CPolgar, WToll, L Novela3ß4 nicotinic acetylcholine receptor-selective ligands. Discovery, structure-activity studies, and pharmacological evaluation. J Med Chem 53:8187-91 (2010)  
Target
Name:
Neuronal acetylcholine receptor subunit alpha-4/beta-2
Synonyms:
Neuronal acetylcholine receptor alpha4/beta2 Neuronal acetylcholine receptor; alpha4/beta2
Type:
Mol. Mass.:
Description:
Components:
This complex has 0 components.
Component 1
Name:
Neuronal acetylcholine receptor subunit alpha-4
Synonyms:
ACHA4_RAT Cholinergic, Nicotinic Alpha4Beta2 Chrna4 Neuronal acetylcholine receptor (alpha4beta2 nAChR) Neuronal acetylcholine receptor subunit alpha 4 beta 2 | Neuronal acetylcholine receptor subunit alpha-4
Type:
Enzyme
Mol. Mass.:
70196.44
Organism:
Rattus norvegicus (Rat)
Description:
P09483
Residue:
630
  
Component 2
Name:
Neuronal acetylcholine receptor subunit beta-2
Synonyms:
ACHB2_RAT Chrnb2 Neuronal acetylcholine receptor non-alpha-1 chain
Type:
Enzyme
Mol. Mass.:
56910.32
Organism:
Rattus norvegicus (Rat)
Description:
P12390
Residue:
500
  
Inhibitor
Name:
BDBM50147744
Synonyms:
1-{1-[1-(4-Cyclohexyl-phenyl)-ethyl]-piperidin-4-yl}-1,3-dihydro-indol-2-one | CHEMBL97979
Type:
Small organic molecule
Emp. Form.:
C27H34N2O
Mol. Mass.:
402.5717
SMILES:
CC(N1CCC(CC1)N1C(=O)Cc2ccccc12)c1ccc(cc1)C1CCCCC1
: