Target
Neuronal acetylcholine receptor subunit alpha-4/beta-2
Ligand
BDBM50331014
Substrate
Meas. Tech.
ChEMBL_684744 (CHEMBL1285771)
Ki
10.4±n/a nM
Citation
 Zaveri, NJiang, FOlsen, CPolgar, WToll, L Novela3ß4 nicotinic acetylcholine receptor-selective ligands. Discovery, structure-activity studies, and pharmacological evaluation. J Med Chem 53:8187-91 (2010)  
Target
Name:
Neuronal acetylcholine receptor subunit alpha-4/beta-2
Synonyms:
Neuronal acetylcholine receptor alpha4/beta2 Neuronal acetylcholine receptor; alpha4/beta2
Type:
Mol. Mass.:
Description:
Components:
This complex has 0 components.
Component 1
Name:
Neuronal acetylcholine receptor subunit alpha-4
Synonyms:
ACHA4_RAT Cholinergic, Nicotinic Alpha4Beta2 Chrna4 Neuronal acetylcholine receptor (alpha4beta2 nAChR) Neuronal acetylcholine receptor subunit alpha 4 beta 2 | Neuronal acetylcholine receptor subunit alpha-4
Type:
Enzyme
Mol. Mass.:
70196.44
Organism:
Rattus norvegicus (Rat)
Description:
P09483
Residue:
630
  
Component 2
Name:
Neuronal acetylcholine receptor subunit beta-2
Synonyms:
ACHB2_RAT Chrnb2 Neuronal acetylcholine receptor non-alpha-1 chain
Type:
Enzyme
Mol. Mass.:
56910.32
Organism:
Rattus norvegicus (Rat)
Description:
P12390
Residue:
500
  
Inhibitor
Name:
BDBM50331014
Synonyms:
9-methyl-3-(pyridin-3-yl)-9-azabicyclo[3.3.1]non-2-ene | CHEMBL1276234
Type:
Small organic molecule
Emp. Form.:
C14H18N2
Mol. Mass.:
214.3061
SMILES:
CN1C2CCCC1C=C(C2)c1cccnc1
: