Target
Neuronal acetylcholine receptor subunit alpha-7
Ligand
BDBM50331011
Substrate
Meas. Tech.
ChEMBL_684745 (CHEMBL1285772)
Ki
100000±n/a nM
Citation
 Zaveri, NJiang, FOlsen, CPolgar, WToll, L Novela3ß4 nicotinic acetylcholine receptor-selective ligands. Discovery, structure-activity studies, and pharmacological evaluation. J Med Chem 53:8187-91 (2010)  
Target
Name:
Neuronal acetylcholine receptor subunit alpha-7
Synonyms:
ACHA7_RAT Cholinergic, Nicotinic Alpha7 Chrna7 Neuronal acetylcholine receptor (alpha7 nAChR) Neuronal acetylcholine receptor subunit alpha-7 Neuronal acetylcholine receptor subunit alpha-7 (nAChR)
Type:
Enzyme
Mol. Mass.:
56502.44
Organism:
Rattus norvegicus (Rat)
Description:
Q05941
Residue:
502
  
Inhibitor
Name:
BDBM50331011
Synonyms:
1-(1-(9-methyl-9-azabicyclo[3.3.1]nonan-3-yl)indolin-2-one | CHEMBL1276200
Type:
Small organic molecule
Emp. Form.:
C17H22N2O
Mol. Mass.:
270.3694
SMILES:
CN1C2CCCC1CC(C2)N1C(=O)Cc2ccccc12
: