Target
Neuronal acetylcholine receptor subunit alpha-7
Ligand
BDBM50331016
Substrate
Meas. Tech.
ChEMBL_684745 (CHEMBL1285772)
Ki
424±n/a nM
Citation
 Zaveri, NJiang, FOlsen, CPolgar, WToll, L Novela3ß4 nicotinic acetylcholine receptor-selective ligands. Discovery, structure-activity studies, and pharmacological evaluation. J Med Chem 53:8187-91 (2010)  
Target
Name:
Neuronal acetylcholine receptor subunit alpha-7
Synonyms:
ACHA7_RAT Cholinergic, Nicotinic Alpha7 Chrna7 Neuronal acetylcholine receptor (alpha7 nAChR) Neuronal acetylcholine receptor subunit alpha-7 Neuronal acetylcholine receptor subunit alpha-7 (nAChR)
Type:
Enzyme
Mol. Mass.:
56502.44
Organism:
Rattus norvegicus (Rat)
Description:
Q05941
Residue:
502
  
Inhibitor
Name:
BDBM50331016
Synonyms:
6-benzyl-3-(pyridin-3-yl)-6-azabicyclo[3.2.2]non-2-ene | CHEMBL1277968
Type:
Small organic molecule
Emp. Form.:
C20H22N2
Mol. Mass.:
290.4021
SMILES:
C(N1CC2CCC1CC(=C2)c1cccnc1)c1ccccc1
: