Target
Transient receptor potential cation channel subfamily V member 1
Ligand
BDBM50331125
Substrate
Meas. Tech.
ChEMBL_686303 (CHEMBL1293059)
IC50
2460±n/a nM
Citation
 Hawryluk, NAMerit, JELebsack, ADBranstetter, BJHack, MDSwanson, NAo, HMaher, MPBhattacharya, AWang, QFreedman, JMScott, BPWickenden, ADChaplan, SRBreitenbucher, JG Discovery and synthesis of 6,7,8,9-tetrahydro-5H-pyrimido-[4,5-d]azepines as novel TRPV1 antagonists. Bioorg Med Chem Lett 20:7137-41 (2010)  
Target
Name:
Transient receptor potential cation channel subfamily V member 1
Synonyms:
Capsaicin receptor Osm-9-like TRP channel 1 TRPV1_HUMAN Transient receptor potential cation channel subfamily V member 1 (TRPV1) Transient receptor potential cation channel subfamily V member 1(TRPV1) Vanilloid VR1 Vanilloid receptor 1 Vanilloid receptor 1 (VRI/TRPV1)
Type:
Protein
Mol. Mass.:
94960.75
Organism:
Homo sapiens (Human)
Description:
Q8NER1
Residue:
839
  
Inhibitor
Name:
BDBM50331125
Synonyms:
2-isopropyl-N-(6-methoxy-5-(trifluoromethyl)pyridin-2-yl)-7-(3-(trifluoromethyl)pyridin-2-yl)-6,7,8,9-tetrahydro-5H-pyrimido[5,4-d]azepin-4-amine US9422293, 189 | US9738649, Example 189
Type:
Small organic molecule
Emp. Form.:
C24H24F6N6O
Mol. Mass.:
526.4774
SMILES:
COc1nc(Nc2nc(nc3CCN(CCc23)c2ncccc2C(F)(F)F)C(C)C)ccc1C(F)(F)F
: